1
  2
  3
  4
  5
  6
  7
  8
  9
 10
 11
 12
 13
 14
 15
 16
 17
 18
 19
 20
 21
 22
 23
 24
 25
 26
 27
 28
 29
 30
 31
 32
 33
 34
 35
 36
 37
 38
 39
 40
 41
 42
 43
 44
 45
 46
 47
 48
 49
 50
 51
 52
 53
 54
 55
 56
 57
 58
 59
 60
 61
 62
 63
 64
 65
 66
 67
 68
 69
 70
 71
 72
 73
 74
 75
 76
 77
 78
 79
 80
 81
 82
 83
 84
 85
 86
 87
 88
 89
 90
 91
 92
 93
 94
 95
 96
 97
 98
 99
100
101
102
103
104
105
106
107
108
109
110
111
112
113
114
115
116
117
118
119
120
121
122
123
124
125
126
127
128
129
130
131
132
133
134
135
136
137
138
139
140
141
142
143
144
145
146
147
148
149
150
151
152
======================================================================
ERROR: matplotlib.tests.test_backend_pgf.test_xelatex
----------------------------------------------------------------------
Traceback (most recent call last):
  File "/home/nelle/Projets/matplotlib/matplotlib/py2.6/lib/python2.6/site-packages/nose/case.py", line 197, in runTest
    self.test(*self.arg)
  File "/home/nelle/Projets/matplotlib/matplotlib/py2.6/lib/python2.6/site-packages/matplotlib/tests/test_backend_pgf.py", line 40, in backend_switcher
    result = func(*args, **kwargs)
  File "/home/nelle/Projets/matplotlib/matplotlib/py2.6/lib/python2.6/site-packages/matplotlib/tests/test_backend_pgf.py", line 73, in test_xelatex
    if not check_for('xelatex'):
  File "/home/nelle/Projets/matplotlib/matplotlib/py2.6/lib/python2.6/site-packages/matplotlib/tests/test_backend_pgf.py", line 27, in check_for
    stdout=subprocess.PIPE)
  File "/usr/lib/python2.6/subprocess.py", line 623, in __init__
    errread, errwrite)
  File "/usr/lib/python2.6/subprocess.py", line 1141, in _execute_child
    raise child_exception
OSError: [Errno 2] No such file or directory

======================================================================
ERROR: matplotlib.tests.test_backend_pgf.test_pdflatex
----------------------------------------------------------------------
Traceback (most recent call last):
  File "/home/nelle/Projets/matplotlib/matplotlib/py2.6/lib/python2.6/site-packages/nose/case.py", line 197, in runTest
    self.test(*self.arg)
  File "/home/nelle/Projets/matplotlib/matplotlib/py2.6/lib/python2.6/site-packages/matplotlib/tests/test_backend_pgf.py", line 40, in backend_switcher
    result = func(*args, **kwargs)
  File "/home/nelle/Projets/matplotlib/matplotlib/py2.6/lib/python2.6/site-packages/matplotlib/tests/test_backend_pgf.py", line 86, in test_pdflatex
    if not check_for('pdflatex'):
  File "/home/nelle/Projets/matplotlib/matplotlib/py2.6/lib/python2.6/site-packages/matplotlib/tests/test_backend_pgf.py", line 27, in check_for
    stdout=subprocess.PIPE)
  File "/usr/lib/python2.6/subprocess.py", line 623, in __init__
    errread, errwrite)
  File "/usr/lib/python2.6/subprocess.py", line 1141, in _execute_child
    raise child_exception
OSError: [Errno 2] No such file or directory

======================================================================
ERROR: matplotlib.tests.test_backend_pgf.test_rcupdate
----------------------------------------------------------------------
Traceback (most recent call last):
  File "/home/nelle/Projets/matplotlib/matplotlib/py2.6/lib/python2.6/site-packages/nose/case.py", line 197, in runTest
    self.test(*self.arg)
  File "/home/nelle/Projets/matplotlib/matplotlib/py2.6/lib/python2.6/site-packages/matplotlib/tests/test_backend_pgf.py", line 40, in backend_switcher
    result = func(*args, **kwargs)
  File "/home/nelle/Projets/matplotlib/matplotlib/py2.6/lib/python2.6/site-packages/matplotlib/tests/test_backend_pgf.py", line 102, in test_rcupdate
    if not check_for('xelatex') or not check_for('pdflatex'):
  File "/home/nelle/Projets/matplotlib/matplotlib/py2.6/lib/python2.6/site-packages/matplotlib/tests/test_backend_pgf.py", line 27, in check_for
    stdout=subprocess.PIPE)
  File "/usr/lib/python2.6/subprocess.py", line 623, in __init__
    errread, errwrite)
  File "/usr/lib/python2.6/subprocess.py", line 1141, in _execute_child
    raise child_exception
OSError: [Errno 2] No such file or directory

======================================================================
ERROR: Failure: AttributeError ('module' object has no attribute 'test_figure')
----------------------------------------------------------------------
Traceback (most recent call last):
  File "/home/nelle/Projets/matplotlib/matplotlib/py2.6/lib/python2.6/site-packages/nose/loader.py", line 379, in loadTestsFromName
    module = resolve_name(addr.module)
  File "/home/nelle/Projets/matplotlib/matplotlib/py2.6/lib/python2.6/site-packages/nose/util.py", line 331, in resolve_name
    obj = getattr(obj, part)
AttributeError: 'module' object has no attribute 'test_figure'

======================================================================
FAIL: matplotlib.tests.test_axes.test_stackplot.test
----------------------------------------------------------------------
Traceback (most recent call last):
  File "/home/nelle/Projets/matplotlib/matplotlib/py2.6/lib/python2.6/site-packages/nose/case.py", line 197, in runTest
    self.test(*self.arg)
  File "/home/nelle/Projets/matplotlib/matplotlib/py2.6/lib/python2.6/site-packages/matplotlib/testing/decorators.py", line 39, in failer
    result = f(*args, **kwargs)
  File "/home/nelle/Projets/matplotlib/matplotlib/py2.6/lib/python2.6/site-packages/matplotlib/testing/decorators.py", line 158, in do_test
    '(RMS %(rms).3f)'%err)
ImageComparisonFailure: images not close: /home/nelle/Projets/matplotlib/matplotlib/result_images/test_axes/stackplot_test_image.png vs. /home/nelle/Projets/matplotlib/matplotlib/result_images/test_axes/stackplot_test_image-expected.png (RMS 1085.827)

======================================================================
FAIL: matplotlib.tests.test_axes.test_stackplot.test
----------------------------------------------------------------------
Traceback (most recent call last):
  File "/home/nelle/Projets/matplotlib/matplotlib/py2.6/lib/python2.6/site-packages/nose/case.py", line 197, in runTest
    self.test(*self.arg)
  File "/home/nelle/Projets/matplotlib/matplotlib/py2.6/lib/python2.6/site-packages/matplotlib/testing/decorators.py", line 39, in failer
    result = f(*args, **kwargs)
  File "/home/nelle/Projets/matplotlib/matplotlib/py2.6/lib/python2.6/site-packages/matplotlib/testing/decorators.py", line 158, in do_test
    '(RMS %(rms).3f)'%err)
ImageComparisonFailure: images not close: /home/nelle/Projets/matplotlib/matplotlib/result_images/test_axes/stackplot_test_image_pdf.png vs. /home/nelle/Projets/matplotlib/matplotlib/result_images/test_axes/stackplot_test_image-expected_pdf.png (RMS 562.805)

======================================================================
FAIL: matplotlib.tests.test_axes.test_stackplot.test
----------------------------------------------------------------------
Traceback (most recent call last):
  File "/home/nelle/Projets/matplotlib/matplotlib/py2.6/lib/python2.6/site-packages/nose/case.py", line 197, in runTest
    self.test(*self.arg)
  File "/home/nelle/Projets/matplotlib/matplotlib/py2.6/lib/python2.6/site-packages/matplotlib/testing/decorators.py", line 39, in failer
    result = f(*args, **kwargs)
  File "/home/nelle/Projets/matplotlib/matplotlib/py2.6/lib/python2.6/site-packages/matplotlib/testing/decorators.py", line 158, in do_test
    '(RMS %(rms).3f)'%err)
ImageComparisonFailure: images not close: /home/nelle/Projets/matplotlib/matplotlib/result_images/test_axes/stackplot_test_image_svg.png vs. /home/nelle/Projets/matplotlib/matplotlib/result_images/test_axes/stackplot_test_image-expected_svg.png (RMS 903.363)

======================================================================
FAIL: matplotlib.tests.test_text.test_font_styles.test
----------------------------------------------------------------------
Traceback (most recent call last):
  File "/home/nelle/Projets/matplotlib/matplotlib/py2.6/lib/python2.6/site-packages/nose/case.py", line 197, in runTest
    self.test(*self.arg)
  File "/home/nelle/Projets/matplotlib/matplotlib/py2.6/lib/python2.6/site-packages/matplotlib/testing/decorators.py", line 39, in failer
    result = f(*args, **kwargs)
  File "/home/nelle/Projets/matplotlib/matplotlib/py2.6/lib/python2.6/site-packages/matplotlib/testing/decorators.py", line 158, in do_test
    '(RMS %(rms).3f)'%err)
ImageComparisonFailure: images not close: /home/nelle/Projets/matplotlib/matplotlib/result_images/test_text/font_styles.png vs. /home/nelle/Projets/matplotlib/matplotlib/result_images/test_text/font_styles-expected.png (RMS 47.145)

======================================================================
FAIL: matplotlib.tests.test_text.test_font_styles.test
----------------------------------------------------------------------
Traceback (most recent call last):
  File "/home/nelle/Projets/matplotlib/matplotlib/py2.6/lib/python2.6/site-packages/nose/case.py", line 197, in runTest
    self.test(*self.arg)
  File "/home/nelle/Projets/matplotlib/matplotlib/py2.6/lib/python2.6/site-packages/matplotlib/testing/decorators.py", line 39, in failer
    result = f(*args, **kwargs)
  File "/home/nelle/Projets/matplotlib/matplotlib/py2.6/lib/python2.6/site-packages/matplotlib/testing/decorators.py", line 158, in do_test
    '(RMS %(rms).3f)'%err)
ImageComparisonFailure: images not close: /home/nelle/Projets/matplotlib/matplotlib/result_images/test_text/font_styles_pdf.png vs. /home/nelle/Projets/matplotlib/matplotlib/result_images/test_text/font_styles-expected_pdf.png (RMS 23.423)

======================================================================
FAIL: matplotlib.tests.test_text.test_font_styles.test
----------------------------------------------------------------------
Traceback (most recent call last):
  File "/home/nelle/Projets/matplotlib/matplotlib/py2.6/lib/python2.6/site-packages/nose/case.py", line 197, in runTest
    self.test(*self.arg)
  File "/home/nelle/Projets/matplotlib/matplotlib/py2.6/lib/python2.6/site-packages/matplotlib/testing/decorators.py", line 39, in failer
    result = f(*args, **kwargs)
  File "/home/nelle/Projets/matplotlib/matplotlib/py2.6/lib/python2.6/site-packages/matplotlib/testing/decorators.py", line 158, in do_test
    '(RMS %(rms).3f)'%err)
ImageComparisonFailure: images not close: /home/nelle/Projets/matplotlib/matplotlib/result_images/test_text/font_styles_svg.png vs. /home/nelle/Projets/matplotlib/matplotlib/result_images/test_text/font_styles-expected_svg.png (RMS 39.691)

======================================================================
FAIL: matplotlib.tests.test_transforms.test_pre_transform_plotting.test
----------------------------------------------------------------------
Traceback (most recent call last):
  File "/home/nelle/Projets/matplotlib/matplotlib/py2.6/lib/python2.6/site-packages/nose/case.py", line 197, in runTest
    self.test(*self.arg)
  File "/home/nelle/Projets/matplotlib/matplotlib/py2.6/lib/python2.6/site-packages/matplotlib/testing/decorators.py", line 39, in failer
    result = f(*args, **kwargs)
  File "/home/nelle/Projets/matplotlib/matplotlib/py2.6/lib/python2.6/site-packages/matplotlib/testing/decorators.py", line 158, in do_test
    '(RMS %(rms).3f)'%err)
ImageComparisonFailure: images not close: /home/nelle/Projets/matplotlib/matplotlib/result_images/test_transforms/pre_transform_data.png vs. /home/nelle/Projets/matplotlib/matplotlib/result_images/test_transforms/pre_transform_data-expected.png (RMS 925.706)

----------------------------------------------------------------------
Ran 1170 tests in 907.562s

FAILED (KNOWNFAIL=5, errors=4, failures=7)

This paste never expires. View raw. Pasted through import.