1
  2
  3
  4
  5
  6
  7
  8
  9
 10
 11
 12
 13
 14
 15
 16
 17
 18
 19
 20
 21
 22
 23
 24
 25
 26
 27
 28
 29
 30
 31
 32
 33
 34
 35
 36
 37
 38
 39
 40
 41
 42
 43
 44
 45
 46
 47
 48
 49
 50
 51
 52
 53
 54
 55
 56
 57
 58
 59
 60
 61
 62
 63
 64
 65
 66
 67
 68
 69
 70
 71
 72
 73
 74
 75
 76
 77
 78
 79
 80
 81
 82
 83
 84
 85
 86
 87
 88
 89
 90
 91
 92
 93
 94
 95
 96
 97
 98
 99
100
101
102
103
104
105
106
107
108
109
110
111
112
113
114
115
116
117
118
119
120
121
122
123
124
125
126
127
128
129
130
131
132
133
134
135
136
137
138
139
140
141
142
143
144
145
146
147
148
149
150
151
152
153
154
155
156
157
158
159
160
161
162
163
164
165
166
167
168
169
170
171
172
173
174
175
176
177
178
179
180
181
182
183
184
185
186
187
188
189
190
191
192
193
194
195
196
197
198
199
200
201
202
203
204
205
206
207
208
209
210
211
212
213
214
215
216
217
218
219
220
221
222
223
224
225
226
227
228
229
230
231
232
233
234
235
236
237
238
239
240
241
242
243
244
245
246
247
248
249
250
251
252
253
254
255
256
257
258
259
260
261
262
263
264
265
266
267
268
269
270
271
272
273
274
275
276
277
278
279
280
281
282
283
284
285
286
287
288
289
290
291
292
293
294
295
296
297
298
299
300
301
302
303
304
305
306
307
308
309
310
311
312
313
314
315
316
317
318
319
320
321
322
323
324
325
326
327
328
329
330
331
332
333
334
335
336
337
338
339
340
341
342
343
344
345
346
347
348
349
350
351
352
353
354
355
356
357
358
359
360
361
362
363
364
365
366
367
368
369
370
371
372
373
374
375
376
377
378
379
380
381
382
383
384
385
386
387
388
389
390
391
392
393
394
395
396
397
398
399
400
401
402
403
404
405
406
407
408
409
410
411
412
413
414
415
416
417
418
419
420
421
422
423
424
425
426
427
428
429
430
431
432
433
434
435
436
437
438
439
440
441
442
443
444
445
446
447
448
449
450
451
452
453
454
455
456
457
458
459
460
461
462
463
464
465
466
467
468
469
470
471
472
473
474
475
476
477
478
479
480
481
482
483
484
485
486
487
488
489
490
491
492
493
494
trial -e --reactor kqueue twisted/test/test_tcp.py
twisted.test.test_tcp
  AddressTestCase
    test_buildProtocolClient ...                                           [OK]
    test_buildProtocolServer ...                                           [OK]
  CallBackOrderTestCase
    test_loseOrder ...                                                     [OK]
  CannotBindTestCase
    test_cannotBind ...                                                    [OK]
    test_clientBind ...                                                    [OK]
  ConnectorTestCase
    test_connectorIdentity ...                                             [OK]
    test_reconnect ...                                                     [OK]
    test_userFail ...                                                      [OK]
  FactoryTestCase
    test_clientStartStop ...                                               [OK]
    test_serverStartStop ...                                               [OK]
  HalfClose2TestCase
    testNoNotification ...                                                 [OK]
    testShutdownException ...                                              [OK]
  HalfCloseBuggyApplicationTests
    test_readNotificationRaises ... Traceback (most recent call last):
  File "/Users/rnadhani/Codes/Twisted/twisted-kqueue/twisted/test/test_tcp.py", line 1743, in check
    self.assertEqual(len(errors), 1)
twisted.trial.unittest.FailTest: not equal:
a = 0
b = 1

[FAIL]
    test_writeNotificationRaises ...                                       [OK]
  HalfCloseTestCase
    testCloseWriteCloser ... in losewrite
in check
before loopuntil
Traceback (most recent call last):
Failure: twisted.internet.defer.TimeoutError: <twisted.test.test_tcp.HalfCloseTestCase testMethod=testCloseWriteCloser> (testCloseWriteCloser) still running at 120.0 secs
[ERROR]
Traceback (most recent call last):
Failure: twisted.trial.util.DirtyReactorAggregateError: Reactor was unclean.
DelayedCalls: (set twisted.internet.base.DelayedCall.debug = True to debug)
<DelayedCall 0x12acd50 [-7.5101852417e-05s] called=0 cancelled=0 LoopingCall<0>(check, *(), **{})()>
[ERROR]
Traceback (most recent call last):
Failure: twisted.trial.util.DirtyReactorAggregateError: Reactor was unclean.
Selectables:
<<class 'twisted.internet.tcp.Port'> of twisted.test.test_tcp.MyHCFactory on 51850>
[ERROR]
    testWriteCloseNotification ... Traceback (most recent call last):
Failure: twisted.internet.defer.TimeoutError: <twisted.test.test_tcp.HalfCloseTestCase testMethod=testWriteCloseNotification> (testWriteCloseNotification) still running at 120.0 secs
[ERROR]
Traceback (most recent call last):
  File "/Users/rnadhani/Codes/Twisted/twisted-kqueue/twisted/test/test_tcp.py", line 1583, in tearDown
    self.assertEquals(self.client.closed, 0)
twisted.trial.unittest.FailTest: not equal:
a = 1
b = 0

[ERROR]
Traceback (most recent call last):
Failure: twisted.trial.util.DirtyReactorAggregateError: Reactor was unclean.
DelayedCalls: (set twisted.internet.base.DelayedCall.debug = True to debug)
<DelayedCall 0x1336da0 [-7.79628753662e-05s] called=0 cancelled=0 LoopingCall<0>(check, *(), **{})()>
[ERROR]
  LargeBufferTestCase
    testWriter ...                                                         [OK]
  ListeningTestCase
    testNumberedInterface ...                                              [OK]
    testPortRepr ...                                                       [OK]
    testStopListening ...                                                  [OK]
    test_directConnectionLostCall ...                                      [OK]
    test_exceptInConnectionLostCall ...                                    [OK]
    test_exceptInStop ...                                                  [OK]
    test_listen ...                                                        [OK]
    test_restartAfterExcept ...                                            [OK]
    test_restartListening ...                                              [OK]
    test_serverRepr ...                                                    [OK]
  LocalRemoteAddressTestCase
    test_hostAddress ...                                                   [OK]
  LogTestCase
    test_logstrClientSetup ...                                             [OK]
  LoopbackTestCase
    testFailing ...                                                        [OK]
    test_closePortInProtocolFactory ...                                    [OK]
    test_connectByService ...                                              [OK]
    test_connectByServiceFail ...                                          [OK]
    test_connectionRefusedErrorNumber ...                                  [OK]
    test_tcpKeepAlive ...                                                  [OK]
    test_tcpNoDelay ...                                                    [OK]
  PauseProducingTestCase
    test_pauseProducingInConnectionMade ...                                [OK]
  ProperlyCloseFilesTestCase
    test_properlyCloseFiles ...                                            [OK]
  WriteDataTestCase
    test_writeAfterShutdownWithoutReading ...                              [OK]
    test_writer ...                                                        [OK]

===============================================================================
[FAIL]: twisted.test.test_tcp.HalfCloseBuggyApplicationTests.test_readNotificationRaises

Traceback (most recent call last):
  File "/Users/rnadhani/Codes/Twisted/twisted-kqueue/twisted/test/test_tcp.py", line 1743, in check
    self.assertEqual(len(errors), 1)
twisted.trial.unittest.FailTest: not equal:
a = 0
b = 1

===============================================================================
[ERROR]: twisted.test.test_tcp.HalfCloseTestCase.testCloseWriteCloser

Traceback (most recent call last):
Failure: twisted.internet.defer.TimeoutError: <twisted.test.test_tcp.HalfCloseTestCase testMethod=testCloseWriteCloser> (testCloseWriteCloser) still running at 120.0 secs
===============================================================================
[ERROR]: twisted.test.test_tcp.HalfCloseTestCase.testCloseWriteCloser

Traceback (most recent call last):
Failure: twisted.trial.util.DirtyReactorAggregateError: Reactor was unclean.
DelayedCalls: (set twisted.internet.base.DelayedCall.debug = True to debug)
<DelayedCall 0x12acd50 [-7.5101852417e-05s] called=0 cancelled=0 LoopingCall<0>(check, *(), **{})()>
===============================================================================
[ERROR]: twisted.test.test_tcp.HalfCloseTestCase.testCloseWriteCloser

Traceback (most recent call last):
Failure: twisted.trial.util.DirtyReactorAggregateError: Reactor was unclean.
Selectables:
<<class 'twisted.internet.tcp.Port'> of twisted.test.test_tcp.MyHCFactory on 51850>
===============================================================================
[ERROR]: twisted.test.test_tcp.HalfCloseTestCase.testWriteCloseNotification

Traceback (most recent call last):
Failure: twisted.internet.defer.TimeoutError: <twisted.test.test_tcp.HalfCloseTestCase testMethod=testWriteCloseNotification> (testWriteCloseNotification) still running at 120.0 secs
===============================================================================
[ERROR]: twisted.test.test_tcp.HalfCloseTestCase.testWriteCloseNotification

Traceback (most recent call last):
  File "/Users/rnadhani/Codes/Twisted/twisted-kqueue/twisted/test/test_tcp.py", line 1583, in tearDown
    self.assertEquals(self.client.closed, 0)
twisted.trial.unittest.FailTest: not equal:
a = 1
b = 0

===============================================================================
[ERROR]: twisted.test.test_tcp.HalfCloseTestCase.testWriteCloseNotification

Traceback (most recent call last):
Failure: twisted.trial.util.DirtyReactorAggregateError: Reactor was unclean.
DelayedCalls: (set twisted.internet.base.DelayedCall.debug = True to debug)
<DelayedCall 0x1336da0 [-7.79628753662e-05s] called=0 cancelled=0 LoopingCall<0>(check, *(), **{})()>
-------------------------------------------------------------------------------
Ran 40 tests in 240.713s

FAILED (failures=1, errors=6, successes=37)

>>>> test.log >>>>

2010-04-06 18:45:50-0700 [-] Log opened.
2010-04-06 18:45:50-0700 [-] --> twisted.test.test_tcp.AddressTestCase.test_buildProtocolClient <--
2010-04-06 18:45:50-0700 [-] twisted.test.test_tcp.RememberingWrapper starting on 51822
2010-04-06 18:45:50-0700 [-] Starting factory <twisted.test.test_tcp.RememberingWrapper instance at 0x129d6e8>
2010-04-06 18:45:50-0700 [-] Starting factory <twisted.test.test_tcp.RememberingWrapper instance at 0x129d7d8>
2010-04-06 18:45:50-0700 [-] (Port 51822 Closed)
2010-04-06 18:45:50-0700 [-] Stopping factory <twisted.test.test_tcp.RememberingWrapper instance at 0x129d6e8>
2010-04-06 18:45:50-0700 [AccumulatingProtocol,client] Stopping factory <twisted.test.test_tcp.RememberingWrapper instance at 0x129d7d8>
2010-04-06 18:45:50-0700 [-] Main loop terminated.
2010-04-06 18:45:50-0700 [-] --> twisted.test.test_tcp.AddressTestCase.test_buildProtocolServer <--
2010-04-06 18:45:50-0700 [-] twisted.test.test_tcp.RememberingWrapper starting on 51824
2010-04-06 18:45:50-0700 [-] Starting factory <twisted.test.test_tcp.RememberingWrapper instance at 0x12a1170>
2010-04-06 18:45:50-0700 [-] Starting factory <twisted.test.test_tcp.RememberingWrapper instance at 0x12a1af8>
2010-04-06 18:45:50-0700 [-] (Port 51824 Closed)
2010-04-06 18:45:50-0700 [-] Stopping factory <twisted.test.test_tcp.RememberingWrapper instance at 0x12a1170>
2010-04-06 18:45:50-0700 [AccumulatingProtocol,client] Stopping factory <twisted.test.test_tcp.RememberingWrapper instance at 0x12a1af8>
2010-04-06 18:45:50-0700 [-] Main loop terminated.
2010-04-06 18:45:50-0700 [-] --> twisted.test.test_tcp.CallBackOrderTestCase.test_loseOrder <--
2010-04-06 18:45:50-0700 [-] <class 'twisted.test.test_tcp.MyServerFactory'> starting on 51826
2010-04-06 18:45:50-0700 [-] Starting factory <twisted.test.test_tcp.MyServerFactory object at 0x12a0150>
2010-04-06 18:45:50-0700 [-] Starting factory <twisted.test.test_tcp.MyClientFactory object at 0x12a0210>
2010-04-06 18:45:50-0700 [AccumulatingProtocol,client] Stopping factory <twisted.test.test_tcp.MyClientFactory object at 0x12a0210>
2010-04-06 18:45:50-0700 [-] (Port 51826 Closed)
2010-04-06 18:45:50-0700 [-] Stopping factory <twisted.test.test_tcp.MyServerFactory object at 0x12a0150>
2010-04-06 18:45:50-0700 [-] Main loop terminated.
2010-04-06 18:45:50-0700 [-] --> twisted.test.test_tcp.CannotBindTestCase.test_cannotBind <--
2010-04-06 18:45:50-0700 [-] <class 'twisted.test.test_tcp.MyServerFactory'> starting on 51828
2010-04-06 18:45:50-0700 [-] Starting factory <twisted.test.test_tcp.MyServerFactory object at 0x12a03d0>
2010-04-06 18:45:50-0700 [-] (Port 51828 Closed)
2010-04-06 18:45:50-0700 [-] Stopping factory <twisted.test.test_tcp.MyServerFactory object at 0x12a03d0>
2010-04-06 18:45:50-0700 [-] Main loop terminated.
2010-04-06 18:45:50-0700 [-] --> twisted.test.test_tcp.CannotBindTestCase.test_clientBind <--
2010-04-06 18:45:50-0700 [-] <class 'twisted.test.test_tcp.MyServerFactory'> starting on 51829
2010-04-06 18:45:50-0700 [-] Starting factory <twisted.test.test_tcp.MyServerFactory object at 0x12a0310>
2010-04-06 18:45:50-0700 [-] Starting factory <twisted.test.test_tcp.MyClientFactory object at 0x12a0210>
2010-04-06 18:45:50-0700 [Uninitialized] Starting factory <twisted.test.test_tcp.MyClientFactory object at 0x12a0110>
2010-04-06 18:45:50-0700 [-] Stopping factory <twisted.test.test_tcp.MyClientFactory object at 0x12a0110>
2010-04-06 18:45:50-0700 [AccumulatingProtocol,client] Stopping factory <twisted.test.test_tcp.MyClientFactory object at 0x12a0210>
2010-04-06 18:45:50-0700 [-] (Port 51829 Closed)
2010-04-06 18:45:50-0700 [-] Stopping factory <twisted.test.test_tcp.MyServerFactory object at 0x12a0310>
2010-04-06 18:45:50-0700 [-] Main loop terminated.
2010-04-06 18:45:50-0700 [-] --> twisted.test.test_tcp.ConnectorTestCase.test_connectorIdentity <--
2010-04-06 18:45:50-0700 [-] twisted.test.test_tcp.ClosingFactory starting on 51831
2010-04-06 18:45:50-0700 [-] Starting factory <twisted.test.test_tcp.ClosingFactory instance at 0x12a4940>
2010-04-06 18:45:50-0700 [-] Starting factory <twisted.test.test_tcp.ClientStartStopFactory object at 0x12a0
    

This paste never expires. View raw. Pasted through import.